{"text_format":"1","workbook":"xlsx","n_sheets":5,"sheets":["計算結果","残高計算","給付額計算","再評価率","年金現価率"],"not_rendered":{"charts":0,"images":0,"macros":1,"external_links":0,"defined_names":1,"comments":0,"pivot_tables":0},"unopened":[],"bounds":{"document_bytes":16777216,"sheet_cells":100000,"rows_first":2000,"rows_last":500,"rows_between":2000,"halvings":0,"cell_chars":16384,"cell_head_chars":4096},"cells_cut":0,"cells_raw":0,"read":"whole","date_system":"1900"}

{"sheet":"計算結果","index":0,"n_rows":7,"n_cols":19,"rows_kept":7,"cut":false,"hidden":false,"merged":[[0,13,0,23],[1,1,1,9],[1,10,1,12],[4,1,4,9],[5,1,5,9],[2,18,2,25],[3,18,3,25],[6,1,6,9],[3,1,3,9],[2,1,2,9],[2,10,2,12],[3,10,3,12],[4,10,4,12],[5,10,5,12],[6,10,6,12]]}
[null,null,null,null,null,null,null,null,null,null,null,null,null,"給付金額シミュレーション"]
[null,"年度",null,null,null,null,null,null,null,null,"2025-04-01",null,null,"（yyyy/04/01）"]
[null,"生年月日",null,null,null,null,null,null,null,null,"1968-07-17",null,null,"（yyyy/mm/dd）",null,null,null,null,{"$f":"\"退職予定年月日時点で\"&DATEDIF(K3,K7+1,\"y\")&\"歳\"&DATEDIF(K3,K7+1,\"ym\")&\"ヶ月\"","v":"退職予定年月日時点で56歳10ヶ月"}]
[null,"資格取得(入社)日",null,null,null,null,null,null,null,null,"1991-07-22",null,null,"（yyyy/mm/dd）"]
[null,"仮想個人勘定残高（前年）",null,null,null,null,null,null,null,null,6143586,null,null,"円"]
[null,"仮想個人勘定残高（今年）",null,null,null,null,null,null,null,null,6401904,null,null,"円"]
[null,"退職予定年月日",null,null,null,null,null,null,null,null,"2025-06-01",null,null,"（yyyy/mm/dd）",null,null,null,null,{"$f":"IF(INT(K7)>=INT(DATE(YEAR(K3)+65,MONTH(K3),DAY(K3))),\"※65歳以上は算出できません\",\"\")","v":""}]

{"sheet":"残高計算","index":1,"n_rows":60,"n_cols":11,"rows_kept":60,"cut":false,"hidden":true,"merged":[[5,1,5,2],[6,1,6,2],[0,0,0,8],[1,1,1,2],[2,1,2,2],[3,1,3,2],[4,1,4,2]]}
[{"$f":"YEAR(D2)-2018","v":7}]
[null,"年度",null,{"$f":"計算結果!K2","v":"2025-04-01"},"（yyyy/04/01）","累計開始時点満年齢＋端数月",{"$f":"DATEDIF(D3,D2,\"Y\")","v":56},{"$f":"MOD(DATEDIF(D3,D2,\"M\"),12)","v":8},null,"資格喪失日",{"$f":"IF(DATE(YEAR(計算結果!$K$3)+65,MONTH(計算結果!$K$3),DAY(計算結果!$K$3)-1)=計算結果!$K$7,計算結果!$K$7,DATE(YEAR(計算結果!$K$7),MONTH(計算結果!$K$7),DAY(計算結果!$K$7)+1))","v":"2025-06-02"}]
[null,"生年月日",null,{"$f":"計算結果!K3","v":"1968-07-17"},"（yyyy/mm/dd）","加入者期間",{"$f":"DATEDIF(D4,D2,\"Y\")","v":33},null,null,"年齢判定日",{"$f":"DATE(YEAR(計算結果!$K$7),MONTH(計算結果!$K$7),DAY(計算結果!$K$7)+2)","v":"2025-06-03"}]
[null,"資格取得日",null,{"$f":"DATE(YEAR(計算結果!K4),MONTH(計算結果!K4),1)","v":"1991-07-01"},"（yyyy/mm/dd）","累積終了時点満年齢＋端数月",{"$f":"DATEDIF(D3,D8,\"Y\")","v":56},{"$f":"MOD(DATEDIF($D$3,$D$8,\"M\"),12)","v":10},null,"喪失日年齢",{"$f":"DATEDIF(D3,K3,\"y\")","v":56}]
[null,{"$f":"DATE(YEAR($D$2)-1,3,31)","v":"2024-03-31"},null,{"$f":"計算結果!K5","v":6143586},"円"]
[null,{"$f":"DATE(YEAR($D$2),3,31)","v":"2025-03-31"},null,{"$f":"計算結果!K6","v":6401904},"円","再評価率による付利",{"$f":"QUOTIENT(60*12-G4*12-H4,12)","v":3},{"$f":"MOD(60*12-G4*12-H4,12)","v":2}]
[null,"退職予定年齢（定年年齢）",null,{"$f":"IF(DATEDIF(D3,D8,\"Y\")>65,\"65歳以上は算出出来ません\",DATEDIF(D3,D8,\"Y\"))","v":56},"歳","退職予定年齢"]
[null,"退職予定年月",null,{"$f":"DATE(YEAR(K2),MONTH(K2),)","v":"2025-05-31"},"(yyyy/mm)"]
[null,null,null,null,null,null,"再評価率",1.4999999999999999E-2]
[null,"年齢","期間","前年度残高の差額","拠出額","拠出累計","利息相当額","仮想個人勘定残高"]
[null,{"$f":"IF(DATE(YEAR(D8),MONTH(D8),DAY(D8))<DATE(YEAR(D2)+1,MONTH(D2),DAY(D2)),DATEDIF(D3,D8,\"y\"),IF(DATEDIF($D$3,$D$2,\"Y\")>$D$7,\"\",IF(D7>65,\"\",DATEDIF($D$3,$D$2,\"Y\"))))","v":56},{"$f":"IF(DATE(YEAR(D8),MONTH(D8),DAY(D8))<DATE(YEAR(D2)+1,MONTH(D2),DAY(D2)),DATEDIF(D4,DATE(YEAR(D8),MONTH(D8),DAY(D8)+1),\"y\"),DATEDIF($D$4,$D$2,\"Y\"))","v":33},{"$f":"IF(C11=\"\",\"\",ROUND($D$6-$D$5*(1+$H$9),0))","v":166164},{"$f":"IF(B11=\"\",\"\",IF(B11=$D$7,0,IF(B11=($D$7-1),ROUND(D11*(12-(MOD(DATEDIF($D$3,$D$2,\"M\"),12)))/12,0),D11)))","v":0},{"$f":"IF(B11=\"\",\"\",$D$6)","v":6401904},{"$f":"IF(B11=\"\",\"\",ROUND(H11-F11,0))","v":43600},{"$f":"IF(DATE(YEAR(D8),MONTH(D8),DAY(D8))<DATE(YEAR(D2)+1,MONTH(D2),DAY(D2)),D6*(1+H9)^(DATEDIF(DATE(YEAR(D2),3,1),D8,\"m\")/12)+D11*DATEDIF(DATE(YEAR(D2),3,1),D8,\"m\")/12,$D$6)","v":6445503.637557596}]
[null,{"$f":"IF(B11=\"\",\"\",IF(B11+1>$D$7,\"\",B11+1))","v":""},{"$f":"IF(B12=\"\",\"\",IF(B12=$D$7,DATEDIF($D$4,DATE(YEAR($D$8),MONTH($D$8),DAY($D$8)+1),\"Y\"),C11+1))","v":""},{"$f":"IF(C12=\"\",\"\",ROUND($D$6-$D$5*(1+$H$9),0))","v":""},{"$f":"IF(B12=\"\",\"\",IF(AND(B12=$D$7,$H$2>$H$4),ROUND(D12*(12-($H$2-$H$4))/12,0),IF(AND(B12=$D$7,$H$2<$H$4),ROUND(D12*(12+($H$4-$H$2))/12,0),D12)))","v":""},{"$f":"IF(B12=\"\",\"\",IF(B13=\"\",E12+F11,ROUND(F11+E11,0)))","v":""},{"$f":"IF(B12=\"\",\"\",ROUND(H12-F12-SUM($G$11),0))","v":""},{"$f":"IF(B12=\"\",\"\",\nIF(AND(B12=$D$7,$H$2>$H$4),\nROUND(H11+H11*($H$9)*((12-($H$2-$H$4))/12)\n+E12,0),\nIF(AND(B12=$D$7,$H$2<$H$4),\nROUND(H11*(1+$H$9)+(H11*(1+$H$9)+E11)*($H$9)*(($H$4-$H$2)/12)\n+E12,0),ROUND(H11*(1+$H$9)+E12,0))))","v":""}]
[null,{"$f":"IF(B12=\"\",\"\",IF(B12+1>$D$7,\"\",B12+1))","v":""},{"$f":"IF(B13=\"\",\"\",IF(B13=$D$7,DATEDIF($D$4,DATE(YEAR($D$8),MONTH($D$8),DAY($D$8)+1),\"Y\"),C12+1))","v":""},{"$f":"IF(C13=\"\",\"\",ROUND($D$6-$D$5*(1+$H$9),0))","v":""},{"$f":"IF(B13=\"\",\"\",IF(AND(B13=$D$7,$H$2>$H$4),ROUND(D13*(12-($H$2-$H$4))/12,0),IF(AND(B13=$D$7,$H$2<$H$4),ROUND(D13*(12+($H$4-$H$2))/12,0),D13)))","v":""},{"$f":"IF(B13=\"\",\"\",IF(B14=\"\",E13+F12,ROUND(F12+E12,0)))","v":""},{"$f":"IF(B13=\"\",\"\",ROUND(H13-F13-SUM($G$11:G12),0))","v":""},""]
[null,"","","","","",{"$f":"IF(B14=\"\",\"\",ROUND(H14-F14-SUM($G$11:G13),0))","v":""},""]
[null,"","","","","",{"$f":"IF(B15=\"\",\"\",ROUND(H15-F15-SUM($G$11:G14),0))","v":""},""]
[null,"","","","","",{"$f":"IF(B16=\"\",\"\",ROUND(H16-F16-SUM($G$11:G15),0))","v":""},""]
[null,"","","","",{"$f":"IF(B17=\"\",\"\",IF(B18=\"\",E17+F16,ROUND(F16+E16,0)))","v":""},{"$f":"IF(B17=\"\",\"\",ROUND(H17-F17-SUM($G$11:G16),0))","v":""},""]
[null,"","","","","",{"$f":"IF(B18=\"\",\"\",ROUND(H18-F18-SUM($G$11:G17),0))","v":""},""]
[null,"","","","","",{"$f":"IF(B19=\"\",\"\",ROUND(H19-F19-SUM($G$11:G18),0))","v":""},""]
[null,"","","","","",{"$f":"IF(B20=\"\",\"\",ROUND(H20-F20-SUM($G$11:G19),0))","v":""},""]
[null,"",{"$f":"IF(B21=\"\",\"\",IF(B21=$D$7,DATEDIF($D$4,$D$8,\"Y\"),C20+1))","v":""},"","","",{"$f":"IF(B21=\"\",\"\",ROUND(H21-F21-SUM($G$11:G20),0))","v":""},""]
[null,"","","","","",{"$f":"IF(B22=\"\",\"\",ROUND(H22-F22-SUM($G$11:G21),0))","v":""},""]
[null,"","","","","",{"$f":"IF(B23=\"\",\"\",ROUND(H23-F23-SUM($G$11:G22),0))","v":""},""]
[null,"","","","","",{"$f":"IF(B24=\"\",\"\",ROUND(H24-F24-SUM($G$11:G23),0))","v":""},{"$f":"IF(B24=\"\",\"\",\nIF(AND(B24=$D$7,$H$2>$H$4),\nROUND(H23+H23*($H$9)*((12-($H$2-$H$4))/12)\n+E24,0),\nIF(AND(B24=$D$7,$H$2<$H$4),\nROUND(H23*(1+$H$9)+(H23*(1+$H$9)+E23)*($H$9)*(($H$4-$H$2)/12)\n+E24,0),ROUND(H23*(1+$H$9)+E24,0))))","v":""}]
[null,"","","","","",{"$f":"IF(B25=\"\",\"\",ROUND(H25-F25-SUM($G$11:G24),0))","v":""},{"$f":"IF(B25=\"\",\"\",\nIF(AND(B25=$D$7,$H$2>$H$4),\nROUND(H24+H24*($H$9)*((12-($H$2-$H$4))/12)\n+E25,0),\nIF(AND(B25=$D$7,$H$2<$H$4),\nROUND(H24*(1+$H$9)+(H24*(1+$H$9)+E24)*($H$9)*(($H$4-$H$2)/12)\n+E25,0),ROUND(H24*(1+$H$9)+E25,0))))","v":""}]
[null,"","","","","",{"$f":"IF(B26=\"\",\"\",ROUND(H26-F26-SUM($G$11:G25),0))","v":""},""]
[null,"","","","","",{"$f":"IF(B27=\"\",\"\",ROUND(H27-F27-SUM($G$11:G26),0))","v":""},""]
[null,"","","","","",{"$f":"IF(B28=\"\",\"\",ROUND(H28-F28-SUM($G$11:G27),0))","v":""},""]
[null,"","","","","",{"$f":"IF(B29=\"\",\"\",ROUND(H29-F29-SUM($G$11:G28),0))","v":""},""]
[null,"","","","","",{"$f":"IF(B30=\"\",\"\",ROUND(H30-F30-SUM($G$11:G29),0))","v":""},""]
{"$rows_left_out":31}
{"sheet":"給付額計算","index":2,"n_rows":46,"n_cols":29,"rows_kept":46,"cut":false,"hidden":true,"merged":[[10,5,10,8],[10,9,10,12],[10,13,10,16],[10,17,10,20],[10,21,10,24],[10,25,10,28],[10,30,10,31],[11,3,11,4],[11,5,11,8],[11,9,11,12],[11,13,11,16],[11,17,11,20],[11,21,11,24],[11,25,11,28],[11,30,11,31],[8,30,8,31],[9,3,9,4],[9,5,9,8],[9,9,9,12],[9,13,9,16],[9,17,9,20],[9,21,9,24],[9,25,9,28],[9,30,9,31],[6,30,6,31],[7,3,7,4],[7,5,7,8],[7,9,7,12],[7,13,7,16],[7,17,7,20],[7,21,7,24],[7,25,7,28],[7,30,7,31],[4,30,4,31],[5,3,5,4],[5,5,5,8],[5,9,5,12],[5,13,5,16],[5,17,5,20],[5,21,5,24],[5,25,5,28],[5,30,5,31],[4,1,11,1],[4,2,11,2],[4,3,4,4],[4,5,4,8],[4,9,4,12],[4,13,4,16],[4,17,4,20],[4,21,4,24],[4,25,4,28],[6,3,6,4],[6,5,6,8],[6,9,6,12],[6,13,6,16],[6,17,6,20],[6,21,6,24],[6,25,6,28],[8,3,8,4],[8,5,8,8],[8,9,8,12],[8,13,8,16],[8,17,8,20],[8,21,8,24],[8,25,8,28],[10,3,10,4],[3,1,3,8],[3,9,3,12],[3,13,3,16],[3,17,3,20],[3,21,3,24],[3,25,3,28],[3,30,3,31],[3,32,3,33],[3,34,3,35],[1,1,2,8],[1,9,2,12],[1,13,1,14],[1,15,1,16],[1,17,1,18],[1,19,1,20],[1,21,1,22],[1,23,1,24],[1,25,2,28],[2,13,2,14],[2,15,2,16],[2,17,2,18],[2,19,2,20],[2,21,2,22],[2,23,2,24],[26,1,26,28],[43,1,43,28],[19,9,19,12],[18,9,18,12],[15,25,16,28],[16,13,16,14],[16,15,16,16],[16,17,16,18],[16,19,16,20],[16,21,16,22],[15,1,16,8],[15,9,16,12],[15,13,15,14],[15,15,15,16],[16,23,16,24],[17,1,17,8],[17,9,17,12],[17,13,17,16],[17,17,17,20],[17,21,17,24],[15,17,15,18],[15,19,15,20],[15,21,15,22],[15,23,15,24],[17,25,17,28],[17,30,17,31],[17,32,17,33],[17,34,17,35],[18,1,25,1],[18,2,25,2],[18,3,18,4],[18,5,18,8],[18,13,18,16],[18,17,18,20],[18,21,18,24],[18,25,18,28],[18,30,18,31],[19,3,19,4],[19,5,19,8],[19,13,19,16],[19,17,19,20],[19,21,19,24],[19,25,19,28],[19,30,19,31],[20,3,20,4],[20,5,20,8],[20,9,20,12],[20,13,20,16],[20,17,20,20],[20,21,20,24],[20,25,20,28],[20,30,20,31],[21,25,21,28],[21,30,21,31],[22,3,22,4],[22,5,22,8],[22,9,22,12],[22,13,22,16],[22,17,22,20],[22,21,22,24],[22,25,22,28],[22,30,22,31],[21,3,21,4],[21,5,21,8],[21,9,21,12],[21,13,21,16],[21,17,21,20],[21,21,21,24],[23,25,23,28],[23,30,23,31],[24,3,24,4],[24,5,24,8],[24,9,24,12],[24,13,24,16],[24,17,24,20],[24,21,24,24],[24,25,24,28],[24,30,24,31],[23,3,23,4],[23,5,23,8],[23,9,23,12],[23,13,23,16],[23,17,23,20],[23,21,23,24],[25,25,25,28],[25,30,25,31],[25,3,25,4],[25,5,25,8],[25,9,25,12],[25,13,25,16],[25,17,25,20],[25,21,25,24],[34,17,34,20],[34,21,34,24],[34,25,34,28],[32,21,32,22],[32,23,32,24],[32,25,33,28],[33,13,33,14],[33,15,33,16],[33,17,33,18],[33,19,33,20],[33,21,33,22],[33,23,33,24],[32,1,33,8],[32,9,33,12],[32,13,32,14],[32,15,32,16],[32,17,32,18],[32,19,32,20],[35,1,42,1],[35,2,42,2],[35,3,35,4],[35,5,35,8],[35,9,35,12],[35,13,35,16],[37,3,37,4],[37,5,37,8],[37,9,37,12],[37,13,37,16],[35,17,35,20],[36,17,36,20],[37,17,37,20],[34,1,34,8],[34,9,34,12],[34,13,34,16],[35,25,35,28],[36,3,36,4],[36,5,36,8],[36,9,36,12],[36,13,36,16],[36,25,36,28],[37,25,37,28],[38,3,38,4],[38,5,38,8],[38,9,38,12],[38,13,38,16],[38,17,38,20],[38,21,38,24],[38,25,38,28],[35,21,35,24],[36,21,36,24],[37,21,37,24],[39,25,39,28],[40,3,40,4],[40,5,40,8],[40,9,40,12],[40,13,40,16],[40,17,40,20],[40,21,40,24],[40,25,40,28],[39,3,39,4],[39,5,39,8],[39,9,39,12],[39,13,39,16],[39,17,39,20],[39,21,39,24],[41,25,41,28],[42,3,42,4],[42,5,42,8],[42,9,42,12],[42,13,42,16],[42,17,42,20],[42,21,42,24],[42,25,42,28],[41,3,41,4],[41,5,41,8],[41,9,41,12],[41,13,41,16],[41,17,41,20],[41,21,41,24]]}
[null,"【加入者期間１０年未満の場合】　",null,null,null,null,null,null,null,null,null,null,null,null,null,null,null,null,null,null,null,null,null,null,null,null,null,null,"（単位：円）"]
[null,"年金と一時金の選択割合",null,null,null,null,null,null,null,"年金　100％",null,null,null,"年金",null,0.75,null,"年金",null,0.5,null,"年金",null,0.25,null,"一時金　100％"]
[null,null,null,null,null,null,null,null,null,null,null,null,null,"一時金",null,0.25,null,"一時金",null,0.5,null,"一時金",null,0.75]
[null,"一時金額",null,null,null,null,null,null,null,"ー",null,null,null,"ー",null,null,null,"ー",null,null,null,"ー",null,null,null,{"$f":"IF(INT(計算結果!K7)>INT(DATE(YEAR(計算結果!K3)+65,MONTH(計算結果!K3),DAY(計算結果!K3))),\"ー\",IF(VLOOKUP(残高計算!D7,残高計算!$B$10:$H$60,2,FALSE)<10,ROUNDUP(VLOOKUP(残高計算!D7,残高計算!$B$10:$H$60,7,FALSE),-2),\"ー\"))","v":"ー"}]
[null,"年金額","受給期間",20,null,"年間受取額",null,null,null,"ー",null,null,null,"ー",null,null,null,"ー",null,null,null,"ー",null,null,null,"ー"]
[null,null,null,null,null,"（年金受取総額）",null,null,null,"ー",null,null,null,"ー",null,null,null,"ー",null,null,null,"ー",null,null,null,"ー"]
[null,null,null,15,null,"年間受取額",null,null,null,"ー",null,null,null,"ー",null,null,null,"ー",null,null,null,"ー",null,null,null,"ー"]
[null,null,null,null,null,"（年金受取総額）",null,null,null,"ー",null,null,null,"ー",null,null,null,"ー",null,null,null,"ー",null,null,null,"ー"]
[null,null,null,10,null,"年間受取額",null,null,null,"ー",null,null,null,"ー",null,null,null,"ー",null,null,null,"ー",null,null,null,"ー"]
[null,null,null,null,null,"（年金受取総額）",null,null,null,"ー",null,null,null,"ー",null,null,null,"ー",null,null,null,"ー",null,null,null,"ー"]
[null,null,null,5,null,"年間受取額",null,null,null,"ー",null,null,null,"ー",null,null,null,"ー",null,null,null,"ー",null,null,null,"ー"]
[null,null,null,null,null,"（年金受取総額）",null,null,null,"ー",null,null,null,"ー",null,null,null,"ー",null,null,null,"ー",null,null,null,"ー"]
[null,"※　一定の前提条件による試算であり、給付額を保証するものではありません。"]
[]
[null,"【加入者期間１０年以上　退職予定年齢が６０歳以上の場合】",null,null,null,null,null,null,null,null,null,null,null,null,null,null,null,null,null,null,null,null,null,null,null,null,null,null,"（単位：円）"]
[null,"年金と一時金の選択割合",null,null,null,null,null,null,null,"年金　100％",null,null,null,"年金",null,0.75,null,"年金",null,0.5,null,"年金",null,0.25,null,"一時金　100％"]
[null,null,null,null,null,null,null,null,null,null,null,null,null,"一時金",null,0.25,null,"一時金",null,0.5,null,"一時金",null,0.75]
[null,"一時金額",null,null,null,null,null,null,null,"ー",null,null,null,{"$f":"IF($Z$18=\"ー\",\"ー\",ROUNDUP($J$19*P17*年金現価率!$C$7,-2))","v":"ー"},null,null,null,{"$f":"IF($Z$18=\"ー\",\"ー\",ROUNDUP($J$19*T17*年金現価率!$C$7,-2))","v":"ー"},null,null,null,{"$f":"IF($Z$18=\"ー\",\"ー\",ROUNDUP($J$19*X17*年金現価率!$C$7,-2))","v":"ー"},null,null,null,{"$f":"IF(AND(AND(残高計算!G4=59,残高計算!H4=11),残高計算!K4=60),ROUNDUP(VLOOKUP(残高計算!D7,残高計算!$B$10:$H$60,7,FALSE)*1.00125,-2),IF(AND(AND(AND(残高計算!G4=59,残高計算!H4=10),残高計算!K4=60),DAY(計算結果!K3)=1),ROUNDUP(VLOOKUP(残高計算!D7,残高計算!$B$10:$H$60,7,FALSE)*1.0025,-2),IF(INT(計算結果!K7)>INT(DATE(YEAR(計算結果!K3)+65,MONTH(計算結果!K3),DAY(計算結果!K3))),\"ー\",IF(AND(VLOOKUP(残高計算!D7,残高計算!$B$10:$H$60,2,FALSE)>9,残高計算!K4>59)=TRUE,ROUNDUP(VLOOKUP(残高計算!D7,残高計算!$B$10:$H$60,7,FALSE),-2),\"ー\"))))","v":"ー"}]
[null,"年金額","受給期間",20,null,"年間受取額",null,null,null,{"$f":"IF($Z$18=\"ー\",\"ー\",ROUNDUP($Z$18/年金現価率!$C$7,-2))","v":"ー"},null,null,null,{"$f":"IF($Z$18=\"ー\",\"ー\",ROUNDUP($J$19*P16,-2))","v":"ー"},null,null,null,{"$f":"IF($Z$18=\"ー\",\"ー\",ROUNDUP($J$19*T16,-2))","v":"ー"},null,null,null,{"$f":"IF($Z$18=\"ー\",\"ー\",ROUNDUP($J$19*X16,-2))","v":"ー"},null,null,null,"ー"]
[null,null,null,null,null,"（年金受取総額）",null,null,null,{"$f":"IF($Z$18=\"ー\",\"ー\",J19*$D$19)","v":"ー"},null,null,null,{"$f":"IF($Z$18=\"ー\",\"ー\",N19*$D$19)","v":"ー"},null,null,null,{"$f":"IF($Z$18=\"ー\",\"ー\",R19*$D$19)","v":"ー"},null,null,null,{"$f":"IF($Z$18=\"ー\",\"ー\",V19*$D$19)","v":"ー"},null,null,null,"ー"]
[null,null,null,15,null,"年間受取額",null,null,null,{"$f":"IF($Z$18=\"ー\",\"ー\",ROUNDUP($Z$18/年金現価率!$C$6,-2))","v":"ー"},null,null,null,{"$f":"IF($Z$18=\"ー\",\"ー\",ROUNDUP($J$21*P16,-2))","v":"ー"},null,null,null,{"$f":"IF($Z$18=\"ー\",\"ー\",ROUNDUP($J$21*T16,-2))","v":"ー"},null,null,null,{"$f":"IF($Z$18=\"ー\",\"ー\",ROUNDUP($J$21*X16,-2))","v":"ー"},null,null,null,"ー"]
[null,null,null,null,null,"（年金受取総額）",null,null,null,{"$f":"IF($Z$18=\"ー\",\"ー\",J21*$D$21)","v":"ー"},null,null,null,{"$f":"IF($Z$18=\"ー\",\"ー\",N21*$D$21)","v":"ー"},null,null,null,{"$f":"IF($Z$18=\"ー\",\"ー\",R21*$D$21)","v":"ー"},null,null,null,{"$f":"IF($Z$18=\"ー\",\"ー\",V21*$D$21)","v":"ー"},null,null,null,"ー"]
[null,null,null,10,null,"年間受取額",null,null,null,{"$f":"IF($Z$18=\"ー\",\"ー\",ROUNDUP($Z$18/年金現価率!$C$5,-2))","v":"ー"},null,null,null,{"$f":"IF($Z$18=\"ー\",\"ー\",ROUNDUP($J$23*P16,-2))","v":"ー"},null,null,null,{"$f":"IF($Z$18=\"ー\",\"ー\",ROUNDUP($J$23*T16,-2))","v":"ー"},null,null,null,{"$f":"IF($Z$18=\"ー\",\"ー\",ROUNDUP($J$23*X16,-2))","v":"ー"},null,null,null,"ー"]
[null,null,null,null,null,"（年金受取総額）",null,null,null,{"$f":"IF($Z$18=\"ー\",\"ー\",J23*$D$23)","v":"ー"},null,null,null,{"$f":"IF($Z$18=\"ー\",\"ー\",N23*$D$23)","v":"ー"},null,null,null,{"$f":"IF($Z$18=\"ー\",\"ー\",R23*$D$23)","v":"ー"},null,null,null,{"$f":"IF($Z$18=\"ー\",\"ー\",V23*$D$23)","v":"ー"},null,null,null,"ー"]
[null,null,null,5,null,"年間受取額",null,null,null,{"$f":"IF($Z$18=\"ー\",\"ー\",ROUNDUP($Z$18/年金現価率!$C$4,-2))","v":"ー"},null,null,null,{"$f":"IF($Z$18=\"ー\",\"ー\",ROUNDUP($J$25*P16,-2))","v":"ー"},null,null,null,{"$f":"IF($Z$18=\"ー\",\"ー\",ROUNDUP($J$25*T16,-2))","v":"ー"},null,null,null,{"$f":"IF($Z$18=\"ー\",\"ー\",ROUNDUP($J$25*X16,-2))","v":"ー"},null,null,null,"ー"]
[null,null,null,null,null,"（年金受取総額）",null,null,null,{"$f":"IF($Z$18=\"ー\",\"ー\",J25*$D$25)","v":"ー"},null,null,null,{"$f":"IF($Z$18=\"ー\",\"ー\",N25*$D$25)","v":"ー"},null,null,null,{"$f":"IF($Z$18=\"ー\",\"ー\",R25*$D$25)","v":"ー"},null,null,null,{"$f":"IF($Z$18=\"ー\",\"ー\",V25*$D$25)","v":"ー"},null,null,null,"ー"]
[null,"※　年金額は、退職時から給付する前提で計算しています。"]
[null,"※　一定の前提条件による試算であり、給付額を保証するものではありません。"]
[]
[]
{"$rows_left_out":17}
{"sheet":"再評価率","index":3,"n_rows":38,"n_cols":14,"rows_kept":38,"cut":false,"hidden":true,"merged":[]}
[]
[null,"再評価率",{"$f":"残高計算!H9","v":1.4999999999999999E-2}]
[null,"桁数",5]
[]
[null,null,0,1,2,3,4,5,6,7,8,9,10,11]
[null,0,1,{"$f":"$C6+ROUNDUP($C6*($C$2*D$5/12),$C$3)","v":1.00125},{"$f":"$C6+ROUNDUP($C6*($C$2*E$5/12),$C$3)","v":1.0024999999999999},1.0037499999999999,1.0049999999999999,1.0062500000000001,1.0075000000000001,1.00875,1.01,1.01125,1.0125,1.0137499999999999]
[null,1,{"$f":"ROUNDUP(C6*(1+$C$2),$C$3)","v":1.0149999999999999},{"$f":"$C7+ROUNDUP($C7*($C$2*D$5/12),$C$3)","v":1.01627},1.0175399999999999,1.01881,1.0200799999999999,1.02135,1.0226199999999999,1.02389,1.02515,1.0264199999999999,1.02769,1.0289599999999999]
[null,2,{"$f":"ROUNDUP(C7*(1+$C$2),$C$3)","v":1.03023},1.03152,1.03281,1.0341,1.03539,1.03667,1.03796,1.03925,1.04054,1.04183,1.04311,1.0444]
[null,3,1.04569,1.0469999999999999,1.0483100000000001,1.04962,1.0509200000000001,1.05223,1.0535399999999999,1.05484,1.0561499999999999,1.0574600000000001,1.05877,1.0600700000000001]
[null,4,1.06138,1.06271,1.0640400000000001,1.0653699999999999,1.0666899999999999,1.06802,1.06935,1.07067,1.0720000000000001,1.0733299999999999,1.0746499999999999,1.0759799999999999]
[null,5,1.07731,1.07866,1.0800099999999999,1.08135,1.0827,1.08405,1.0853900000000001,1.08674,1.08809,1.0894299999999999,1.0907800000000001,1.09213]
[null,6,1.0934700000000002,1.0948400000000003,1.0962100000000001,1.0975800000000002,1.0989400000000002,1.1003100000000001,1.1016800000000002,1.1030400000000002,1.1044100000000001,1.1057800000000002,1.1071400000000002,1.1085100000000001]
[null,7,1.10988,1.11127,1.11266,1.11405,1.1154299999999999,1.1168199999999999,1.1182099999999999,1.1195999999999999,1.1209799999999999,1.1223699999999999,1.1237599999999999,1.1251499999999999]
[null,8,1.12653,1.1279399999999999,1.1293500000000001,1.13076,1.1321700000000001,1.13358,1.1349800000000001,1.13639,1.1377999999999999,1.1392100000000001,1.14062,1.14202]
[null,9,1.1434300000000002,1.1448600000000002,1.1462900000000003,1.1477200000000001,1.1491500000000001,1.1505800000000002,1.1520100000000002,1.1534400000000002,1.1548700000000001,1.1563000000000001,1.1577300000000001,1.1591600000000002]
[null,10,1.16059,1.16205,1.1635,1.1649499999999999,1.1664000000000001,1.1678500000000001,1.1693,1.17075,1.1721999999999999,1.1736500000000001,1.1751,1.17655]
[null,11,1.1780000000000002,1.1794800000000001,1.1809500000000002,1.1824200000000002,1.1838900000000001,1.1853700000000003,1.1868400000000001,1.1883100000000002,1.1897800000000001,1.1912600000000002,1.1927300000000001,1.1942000000000002]
[null,12,1.19567,1.1971700000000001,1.1986600000000001,1.2001600000000001,1.2016500000000001,1.2031499999999999,1.2046399999999999,1.20614,1.20763,1.20913,1.21062,1.2121200000000001]
[null,13,1.2136100000000001,1.21513,1.21665,1.21817,1.2196800000000001,1.2212000000000001,1.22272,1.2242300000000002,1.2257500000000001,1.2272700000000001,1.22879,1.2303000000000002]
[null,14,1.2318200000000001,1.2333600000000002,1.2349000000000001,1.2364400000000002,1.2379800000000001,1.2395200000000002,1.2410600000000001,1.2426000000000001,1.2441400000000002,1.2456800000000001,1.2472200000000002,1.2487600000000001]
[null,15,1.2503,1.25187,1.25343,1.25499,1.2565599999999999,1.2581199999999999,1.2596799999999999,1.26125,1.26281,1.26437,1.26593,1.2675000000000001]
[null,16,1.2690600000000001,1.2706500000000001,1.27224,1.2738200000000002,1.2754100000000002,1.2770000000000001,1.27858,1.28017,1.28176,1.2833400000000001,1.2849300000000001,1.28651]
[null,17,1.2881,1.28972,1.2913300000000001,1.29294,1.2945500000000001,1.29616,1.2977700000000001,1.29938,1.3009900000000001,1.3026,1.3042100000000001,1.30582]
[null,18,1.3074300000000001,1.3090700000000002,1.3107000000000002,1.3123400000000001,1.3139700000000001,1.3156100000000002,1.3172400000000002,1.3188800000000001,1.3205100000000001,1.3221400000000001,1.3237800000000002,1.3254100000000002]
[null,19,1.3270500000000001,1.3287100000000001,1.3303700000000001,1.33203,1.33369,1.33535,1.33701,1.33867,1.34033,1.34198,1.3436400000000002,1.3453000000000002]
[null,20,1.3469600000000002,1.3486500000000001,1.3503300000000003,1.3520200000000002,1.3537000000000001,1.3553800000000003,1.3570700000000002,1.3587500000000001,1.3604300000000003,1.3621200000000002,1.3638000000000001,1.3654900000000001]
[null,21,1.36717,1.3688800000000001,1.37059,1.3723000000000001,1.37401,1.3757200000000001,1.3774299999999999,1.37914,1.3808499999999999,1.38256,1.38426,1.3859699999999999]
[null,22,1.38768,1.3894200000000001,1.3911500000000001,1.39289,1.39462,1.39636,1.3980900000000001,1.3998300000000001,1.4015599999999999,1.4033,1.40503,1.4067700000000001]
[null,23,1.4085000000000001,1.4102700000000001,1.4120300000000001,1.4137900000000001,1.4155500000000001,1.4173100000000001,1.4190700000000001,1.42083,1.42259,1.42435,1.42611,1.42787]
[null,24,1.42963,1.4314199999999999,1.4332099999999999,1.4350000000000001,1.4367799999999999,1.4385699999999999,1.4403599999999999,1.44214,1.4439299999999999,1.4457199999999999,1.4475099999999999,1.44929]
{"$rows_left_out":9}
{"sheet":"年金現価率","index":4,"n_rows":7,"n_cols":3,"rows_kept":7,"cut":false,"hidden":true,"merged":[[2,1,2,3],[3,2,3,3],[4,2,4,3],[5,2,5,3],[6,2,6,3]]}
[]
[]
[null,"年金現価率"]
[null,5,4.7039999999999997]
[null,10,8.8610000000000007]
[null,15,12.536]
[null,20,15.784000000000001]